Build errors

Full logs: ya_make_output.txt | ya_log.txt | ya_evlog.jsonl

Other compiler errors

Run(SJEVdGbAyeNBHn5kNEQ_TA$(BUILD_ROOT)/cloud/blockstore/libs/storage/core/disk_counters.cpp.o)

cloud/blockstore/libs/storage/core/disk_counters.cpp:244:25: error: use of undeclared identifier 'meta'
  244 |         auto& counter = meta.GetValue(RequestCounters);
      |                         ^
cloud/blockstore/libs/storage/core/disk_counters.cpp:250:58: error: use of undeclared identifier 'meta'
  250 |                 counters->GetSubgroup("request", TString(meta.Name)),
      |                                                          ^
2 errors generated.

Run(fq7om5ye6O1VG_D8mqdyUQ$(BUILD_ROOT)/cloud/blockstore/apps/client/lib/ut/cloud-blockstore-apps-client-lib-ut)

ld.lld: error: undefined symbol: void Out<NCloud::TSizeInterval>(IOutputStream&, TTypeTraits<NCloud::TSizeInterval>::TFuncParam)
>>> referenced by output.h:238 (util/stream/output.h:238)
>>>               config.cpp.o:(NCloud::NBlockStore::TDiagnosticsConfig::Dump(IOutputStream&) const) in archive cloud/blockstore/libs/diagnostics/libblockstore-libs-diagnostics.a
>>> referenced by output.h:238 (util/stream/output.h:238)
>>>               config.cpp.o:(NCloud::NBlockStore::TDiagnosticsConfig::Dump(IOutputStream&) const) in archive cloud/blockstore/libs/diagnostics/libblockstore-libs-diagnostics.a
>>> referenced by output.h:238 (util/stream/output.h:238)
>>>               config.cpp.o:(NCloud::NBlockStore::TDiagnosticsConfig::DumpHtml(IOutputStream&) const) in archive cloud/blockstore/libs/diagnostics/libblockstore-libs-diagnostics.a
>>> referenced 1 more times
clang++: error: linker command failed with exit code 1 (use -v to see invocation)

Run(qyCGdxIl0dQUUr4MdbkfEw$(BUILD_ROOT)/cloud/blockstore/tools/nbd/blockstore-nbd)

ld.lld: error: undefined symbol: void Out<NCloud::TSizeInterval>(IOutputStream&, TTypeTraits<NCloud::TSizeInterval>::TFuncParam)
>>> referenced by output.h:238 (util/stream/output.h:238)
>>>               config.cpp.o:(NCloud::NBlockStore::TDiagnosticsConfig::Dump(IOutputStream&) const) in archive cloud/blockstore/libs/diagnostics/libblockstore-libs-diagnostics.a
>>> referenced by output.h:238 (util/stream/output.h:238)
>>>               config.cpp.o:(NCloud::NBlockStore::TDiagnosticsConfig::Dump(IOutputStream&) const) in archive cloud/blockstore/libs/diagnostics/libblockstore-libs-diagnostics.a
>>> referenced by output.h:238 (util/stream/output.h:238)
>>>               config.cpp.o:(NCloud::NBlockStore::TDiagnosticsConfig::DumpHtml(IOutputStream&) const) in archive cloud/blockstore/libs/diagnostics/libblockstore-libs-diagnostics.a
>>> referenced 1 more times
clang++: error: linker command failed with exit code 1 (use -v to see invocation)

Run(CJn8RT0Fzkkn3JN_no-Nwg$(BUILD_ROOT)/cloud/blockstore/apps/client/blockstore-client)

ld.lld: error: undefined symbol: void Out<NCloud::TSizeInterval>(IOutputStream&, TTypeTraits<NCloud::TSizeInterval>::TFuncParam)
>>> referenced by output.h:238 (util/stream/output.h:238)
>>>               config.cpp.o:(NCloud::NBlockStore::TDiagnosticsConfig::Dump(IOutputStream&) const) in archive cloud/blockstore/libs/diagnostics/libblockstore-libs-diagnostics.a
>>> referenced by output.h:238 (util/stream/output.h:238)
>>>               config.cpp.o:(NCloud::NBlockStore::TDiagnosticsConfig::Dump(IOutputStream&) const) in archive cloud/blockstore/libs/diagnostics/libblockstore-libs-diagnostics.a
>>> referenced by output.h:238 (util/stream/output.h:238)
>>>               config.cpp.o:(NCloud::NBlockStore::TDiagnosticsConfig::DumpHtml(IOutputStream&) const) in archive cloud/blockstore/libs/diagnostics/libblockstore-libs-diagnostics.a
>>> referenced 1 more times
clang++: error: linker command failed with exit code 1 (use -v to see invocation)

Run(Iq5ZfEp_BPlLIv89jfU1wA$(BUILD_ROOT)/cloud/blockstore/apps/server_lightweight/nbsd-lightweight $(BUILD_ROOT)/cloud/blockstore/apps/server_lightweight/nbsd-lightweight.debug)

ld.lld: error: undefined symbol: void Out<NCloud::TSizeInterval>(IOutputStream&, TTypeTraits<NCloud::TSizeInterval>::TFuncParam)
>>> referenced by output.h:238 (util/stream/output.h:238)
>>>               config.cpp.o:(NCloud::NBlockStore::TDiagnosticsConfig::Dump(IOutputStream&) const) in archive cloud/blockstore/libs/diagnostics/libblockstore-libs-diagnostics.a
>>> referenced by output.h:238 (util/stream/output.h:238)
>>>               config.cpp.o:(NCloud::NBlockStore::TDiagnosticsConfig::Dump(IOutputStream&) const) in archive cloud/blockstore/libs/diagnostics/libblockstore-libs-diagnostics.a
>>> referenced by output.h:238 (util/stream/output.h:238)
>>>               config.cpp.o:(NCloud::NBlockStore::TDiagnosticsConfig::DumpHtml(IOutputStream&) const) in archive cloud/blockstore/libs/diagnostics/libblockstore-libs-diagnostics.a
>>> referenced 1 more times
clang++: error: linker command failed with exit code 1 (use -v to see invocation)