Build errors

Full logs: ya_make_output.txt | ya_log.txt | ya_evlog.jsonl

Other compiler errors

Run(TdBzwWnbPDgD30zXUFLX1Q$(BUILD_ROOT)/cloud/filestore/apps/server/filestore-server $(BUILD_ROOT)/cloud/filestore/apps/server/filestore-server.debug)

ld.lld: error: undefined symbol: NSQLTranslationV1::MakeTranslator()
>>> referenced by yql_facade.cpp:736 (yql/essentials/core/facade/yql_facade.cpp:736)
>>>               yql_facade.cpp.o:(NYql::TProgram::ParseSql(NSQLTranslation::TTranslationSettings const&)) in archive yql/essentials/core/facade/libessentials-core-facade.a
>>> referenced by worker_factory.cpp:214 (yql/essentials/public/purecalc/common/worker_factory.cpp:214)
>>>               worker_factory.cpp.o:(NYql::NPureCalc::TWorkerFactory<NYql::NPureCalc::IPullStreamWorkerFactory>::Compile(TBasicStringBuf<char, std::__y1::char_traits<char>>, NYql::NPureCalc::ETranslationMode, std::__y1::shared_ptr<NYql::IModuleResolver>, unsigned short, THashMap<TBasicString<char, std::__y1::char_traits<char>>, TBasicString<char, std::__y1::char_traits<char>>, THash<TBasicString<char, std::__y1::char_traits<char>>>, TEqualTo<TBasicString<char, std::__y1::char_traits<char>>>, std::__y1::allocator<TBasicString<char, std::__y1::char_traits<char>>>> const&, NYql::NPureCalc::TInputSpecBase const&, NYql::NPureCalc::TOutputSpecBase const&, bool, NYql::NPureCalc::EProcessorMode)) in archive contrib/ydb/core/fq/libs/row_dispatcher/purecalc_no_pg_wrapper/liblibs-row_dispatcher-purecalc_no_pg_wrapper.a
>>> referenced by worker_factory.cpp:214 (yql/essentials/public/purecalc/common/worker_factory.cpp:214)
>>>               worker_factory.cpp.o:(NYql::NPureCalc::TWorkerFactory<NYql::NPureCalc::IPullListWorkerFactory>::Compile(TBasicStringBuf<char, std::__y1::char_traits<char>>, NYql::NPureCalc::ETranslationMode, std::__y1::shared_ptr<NYql::IModuleResolver>, unsigned short, THashMap<TBasicString<char, std::__y1::char_traits<char>>, TBasicString<char, std::__y1::char_traits<char>>, THash<TBasicString<char, std::__y1::char_traits<char>>>, TEqualTo<TBasicString<char, std::__y1::char_traits<char>>>, std::__y1::allocator<TBasicString<char, std::__y1::char_traits<char>>>> const&, NYql::NPureCalc::TInputSpecBase const&, NYql::NPureCalc::TOutputSpecBase const&, bool, NYql::NPureCalc::EProcessorMode)) in archive contrib/ydb/core/fq/libs/row_dispatcher/purecalc_no_pg_wrapper/liblibs-row_dispatcher-purecalc_no_pg_wrapper.a
>>> referenced 6 more times
>>> did you mean: NSQLTranslationV0::MakeTranslator()
>>> defined in: yql/essentials/sql/v0/libessentials-sql-v0.a(sql.cpp.o)

ld.lld: error: undefined symbol: NYdb::NDump::BuildCreateViewQuery(TBasicString<char, std::__y1::char_traits<char>> const&, TBasicString<char, std::__y1::char_traits<char>> const&, TBasicString<char, std::__y1::char_traits<char>> const&, TBasicString<char, std::__y1::char_traits<char>> const&, NYql::TIssues&)
>>> referenced by schemeshard_export_uploaders.cpp:190 (contrib/ydb/core/tx/schemeshard/schemeshard_export_uploaders.cpp:190)
>>>               schemeshard_export_uploaders.cpp.o:(NKikimr::NSchemeShard::TSchemeUploader::BuildViewScheme(TBasicString<char, std::__y1::char_traits<char>> const&, NKikimrSchemeOp::TViewDescription const&, TBasicString<char, std::__y1::char_traits<char>> const&, TBasicString<char, std::__y1::char_traits<char>>&)) in archive contrib/ydb/core/tx/schemeshard/libcore-tx-schemeshard.a

ld.lld: error: undefined symbol: NYdb::NDump::RewriteCreateViewQuery(TBasicString<char, std::__y1::char_traits<char>>&, TBasicString<char, std::__y1::char_traits<char>> const&, bool, TBasicString<char, std::__y1::char_traits<char>> const&, NYql::TIssues&)
>>> referenced by schemeshard_import__create.cpp:1027 (contrib/ydb/core/tx/schemeshard/schemeshard_import__create.cpp:1027)
>>>               schemeshard_import__create.cpp.o:(NKikimr::NSchemeShard::TSchemeShard::TImport::TTxProgress::OnSchemeResult(NKikimr::NTabletFlatExecutor::TTransactionContext&, NActors::TActorContext const&)) in archive contrib/ydb/core/tx/schemeshard/libcore-tx-schemeshard.a
clang++: error: linker command failed with exit code 1 (use -v to see invocation)

Run(dFyp8fybBvF1GV3IyDkvAQ$(BUILD_ROOT)/cloud/filestore/apps/vhost/filestore-vhost $(BUILD_ROOT)/cloud/filestore/apps/vhost/filestore-vhost.debug $(BUILD_ROOT)/cloud/filestore/apps/vhost/libvirtiofsd.so)

ld.lld: error: undefined symbol: NSQLTranslationV1::MakeTranslator()
>>> referenced by yql_facade.cpp:736 (yql/essentials/core/facade/yql_facade.cpp:736)
>>>               yql_facade.cpp.o:(NYql::TProgram::ParseSql(NSQLTranslation::TTranslationSettings const&)) in archive yql/essentials/core/facade/libessentials-core-facade.a
>>> referenced by worker_factory.cpp:214 (yql/essentials/public/purecalc/common/worker_factory.cpp:214)
>>>               worker_factory.cpp.o:(NYql::NPureCalc::TWorkerFactory<NYql::NPureCalc::IPullStreamWorkerFactory>::Compile(TBasicStringBuf<char, std::__y1::char_traits<char>>, NYql::NPureCalc::ETranslationMode, std::__y1::shared_ptr<NYql::IModuleResolver>, unsigned short, THashMap<TBasicString<char, std::__y1::char_traits<char>>, TBasicString<char, std::__y1::char_traits<char>>, THash<TBasicString<char, std::__y1::char_traits<char>>>, TEqualTo<TBasicString<char, std::__y1::char_traits<char>>>, std::__y1::allocator<TBasicString<char, std::__y1::char_traits<char>>>> const&, NYql::NPureCalc::TInputSpecBase const&, NYql::NPureCalc::TOutputSpecBase const&, bool, NYql::NPureCalc::EProcessorMode)) in archive contrib/ydb/core/fq/libs/row_dispatcher/purecalc_no_pg_wrapper/liblibs-row_dispatcher-purecalc_no_pg_wrapper.a
>>> referenced by worker_factory.cpp:214 (yql/essentials/public/purecalc/common/worker_factory.cpp:214)
>>>               worker_factory.cpp.o:(NYql::NPureCalc::TWorkerFactory<NYql::NPureCalc::IPullListWorkerFactory>::Compile(TBasicStringBuf<char, std::__y1::char_traits<char>>, NYql::NPureCalc::ETranslationMode, std::__y1::shared_ptr<NYql::IModuleResolver>, unsigned short, THashMap<TBasicString<char, std::__y1::char_traits<char>>, TBasicString<char, std::__y1::char_traits<char>>, THash<TBasicString<char, std::__y1::char_traits<char>>>, TEqualTo<TBasicString<char, std::__y1::char_traits<char>>>, std::__y1::allocator<TBasicString<char, std::__y1::char_traits<char>>>> const&, NYql::NPureCalc::TInputSpecBase const&, NYql::NPureCalc::TOutputSpecBase const&, bool, NYql::NPureCalc::EProcessorMode)) in archive contrib/ydb/core/fq/libs/row_dispatcher/purecalc_no_pg_wrapper/liblibs-row_dispatcher-purecalc_no_pg_wrapper.a
>>> referenced 6 more times
>>> did you mean: NSQLTranslationV0::MakeTranslator()
>>> defined in: yql/essentials/sql/v0/libessentials-sql-v0.a(sql.cpp.o)

ld.lld: error: undefined symbol: NYdb::NDump::BuildCreateViewQuery(TBasicString<char, std::__y1::char_traits<char>> const&, TBasicString<char, std::__y1::char_traits<char>> const&, TBasicString<char, std::__y1::char_traits<char>> const&, TBasicString<char, std::__y1::char_traits<char>> const&, NYql::TIssues&)
>>> referenced by schemeshard_export_uploaders.cpp:190 (contrib/ydb/core/tx/schemeshard/schemeshard_export_uploaders.cpp:190)
>>>               schemeshard_export_uploaders.cpp.o:(NKikimr::NSchemeShard::TSchemeUploader::BuildViewScheme(TBasicString<char, std::__y1::char_traits<char>> const&, NKikimrSchemeOp::TViewDescription const&, TBasicString<char, std::__y1::char_traits<char>> const&, TBasicString<char, std::__y1::char_traits<char>>&)) in archive contrib/ydb/core/tx/schemeshard/libcore-tx-schemeshard.a

ld.lld: error: undefined symbol: NYdb::NDump::RewriteCreateViewQuery(TBasicString<char, std::__y1::char_traits<char>>&, TBasicString<char, std::__y1::char_traits<char>> const&, bool, TBasicString<char, std::__y1::char_traits<char>> const&, NYql::TIssues&)
>>> referenced by schemeshard_import__create.cpp:1027 (contrib/ydb/core/tx/schemeshard/schemeshard_import__create.cpp:1027)
>>>               schemeshard_import__create.cpp.o:(NKikimr::NSchemeShard::TSchemeShard::TImport::TTxProgress::OnSchemeResult(NKikimr::NTabletFlatExecutor::TTransactionContext&, NActors::TActorContext const&)) in archive contrib/ydb/core/tx/schemeshard/libcore-tx-schemeshard.a
clang++: error: linker command failed with exit code 1 (use -v to see invocation)